{"text_format":"1","workbook":"xlsx","n_sheets":18,"sheets":["Berech. Lagerraum flüssig+fest","Betriebe mit Separation","Abweichende Werte","Zu- und Abgang","Separierung","Tiere","Tiere orginal","org Dünger","Stroh","Erläuterungen","alt Tiere","Tabelle1","Tabelle2","Hinweise zum Programm","Tiere2","Lagerr. GL. rote Gebiete","Tabelle3","Niederschläge"],"not_rendered":{"charts":0,"images":3,"macros":1,"external_links":0,"defined_names":17,"comments":8,"pivot_tables":0},"unopened":[],"bounds":{"document_bytes":16777216,"sheet_cells":100000,"rows_first":2000,"rows_last":500,"rows_between":2000,"halvings":0,"cell_chars":16384,"cell_head_chars":4096},"cells_cut":0,"cells_raw":0,"read":"whole","date_system":"1900"}

{"sheet":"Berech. Lagerraum flüssig+fest","index":0,"n_rows":160,"n_cols":94,"rows_kept":160,"cut":false,"hidden":false,"merged":[[134,39,140,39],[134,37,140,37],[133,2,133,7],[134,38,140,38],[134,20,140,20],[134,17,140,17],[134,18,140,18],[119,0,119,1],[115,6,115,7],[121,0,121,1],[134,23,140,23],[118,0,118,1],[117,0,117,7],[134,19,140,19],[134,25,140,25],[1,0,1,5],[2,2,2,5],[121,2,121,7],[119,2,119,7],[120,2,120,7],[120,0,120,1],[118,2,118,7],[115,2,115,3],[108,6,108,7],[112,2,112,3],[107,2,107,3],[42,0,42,5],[40,0,40,5],[43,0,43,5],[30,0,30,2],[41,0,41,5],[106,6,106,7],[39,0,39,5],[1,7,1,9],[4,0,4,9],[5,0,6,9],[106,2,106,3],[134,42,140,42],[134,33,140,33],[134,34,140,34],[134,35,140,35],[134,36,140,36],[116,0,116,1],[114,6,114,7],[108,0,108,1],[114,2,114,3],[115,0,115,1],[110,6,110,7],[110,2,110,3],[113,2,113,3],[116,2,116,3],[110,4,110,5],[113,0,113,1],[110,0,110,1],[108,2,108,3],[116,6,116,7],[111,6,111,7],[114,0,114,1],[111,2,111,3],[112,6,112,7],[113,6,113,7],[134,41,140,41],[19,71,19,72],[109,4,109,5],[109,0,109,1],[109,6,109,7],[105,4,105,5],[48,0,48,9],[109,2,109,3],[107,0,107,1],[107,6,107,7],[105,8,105,9],[26,0,26,2],[31,0,31,2],[38,6,38,7],[36,0,36,2],[33,0,33,2],[34,0,34,7],[56,3,56,5],[106,4,106,5],[101,0,101,9],[108,4,108,5],[105,6,105,7],[105,2,105,3],[107,4,107,5],[18,98,18,99],[19,68,19,70],[27,0,27,2],[19,54,19,56],[29,0,29,2],[17,0,20,2],[19,92,19,93],[19,77,19,79],[19,74,19,76],[28,0,28,2],[19,82,19,83],[24,0,24,2],[19,46,19,48],[19,49,19,51],[22,0,22,2],[19,80,19,81],[18,4,18,5],[25,0,25,2],[18,63,18,65],[19,42,19,44],[18,22,18,25],[18,26,18,29],[18,46,18,51],[18,17,18,19],[18,39,18,44],[23,0,23,2],[78,8,78,9],[17,15,17,18],[18,15,18,16],[75,3,75,4],[75,7,75,8],[51,0,51,9],[17,3,17,7],[32,0,32,2],[35,0,35,2],[19,39,19,41],[19,35,19,37],[18,32,18,37],[19,32,19,34],[18,6,18,7],[17,8,17,9],[17,22,17,29],[37,0,37,2]]}
["Antragsteller (Name, Vorname bzw. Unternehmensbezeichnung)",null,null,null,null,null,"Betriebsnummer"]
[null,null,null,null,null,null,"09"]
[" Anlage zum Antrag vom "]
["nach Richtlinie vom XX. Mai 2023; Az. G4-7271-1/XXXX"]
["Berechnung Lagerraum für Gülle, Jauche und Festmist für tierhaltende Betriebe  "]
["Erhöhung der Lagerkapazität für flüssigen Wirtschaftsdünger auf 9 Monate / Festmist auf 4 Monate "]
[]
[null,null,null,null,null,null,null,null,null,null,null,null,null,null,null,"Landkreis aus Betriebsnummer"]
["Alle Eingaben aus der Ziellösung!",null,"Zieljahr:",null,null,null,null,null,null,null,null,null,null,null,null,{"$f":"+H2","v":0},{"$f":"LEFT(P9,3)","v":"0"},{"$f":"IF(Q9=Niederschläge!A2:A97,Niederschläge!D2:D97,0)","v":0}]
[null,{"$f":"IF(BG39=2,IF(B11<3000,\"Milchleistung nicht plausibel\",\" \"),\" \")","v":" "}]
{"$rows_left_out":151}
{"sheet":"Betriebe mit Separation","index":1,"n_rows":154,"n_cols":71,"rows_kept":154,"cut":false,"hidden":true,"merged":[[0,0,0,7],[5,1,5,3],[6,1,6,3],[7,1,7,3],[8,1,8,3],[10,5,11,5],[10,6,11,9],[19,3,19,7],[19,8,19,9],[20,4,20,5],[20,6,20,7],[20,15,20,16],[20,17,20,20],[20,23,20,25],[20,27,20,29],[20,46,20,48],[20,81,20,82],[21,37,21,39],[21,51,21,53],[21,54,21,55],[21,57,21,59],[21,60,21,62],[21,65,21,66],[22,31,22,34],[24,0,24,2],[25,0,25,2],[26,0,26,2],[27,0,27,2],[28,0,28,2],[29,0,29,2],[30,0,30,2],[31,0,31,2],[32,0,32,2],[33,0,33,2],[34,0,34,2],[35,0,35,2],[36,0,36,7],[37,0,37,2],[38,0,38,2],[39,0,39,2],[40,6,40,7],[41,0,41,5],[42,0,42,5],[43,0,43,5],[53,0,53,9],[58,3,58,5],[80,8,80,9],[105,0,105,9],[107,2,107,3],[107,4,107,5],[107,6,107,7],[107,8,107,9],[108,2,108,3],[108,4,108,5],[108,6,108,7],[109,0,109,1],[109,2,109,3],[109,4,109,5],[109,6,109,7],[110,0,110,1],[110,2,110,3],[110,4,110,5],[110,6,110,7],[111,0,111,1],[111,2,111,3],[111,4,111,5],[111,6,111,7],[112,0,112,1],[112,2,112,3],[112,4,112,5],[112,6,112,7],[113,2,113,3],[113,6,113,7],[114,2,114,3],[114,6,114,7],[115,0,115,1],[115,2,115,3],[115,6,115,7],[116,0,116,1],[116,2,116,3],[116,6,116,7],[117,0,117,1],[117,2,117,3],[117,6,117,7],[118,0,118,1],[118,2,118,3],[118,6,118,7],[119,5,119,7],[120,0,120,1],[120,2,120,7],[121,0,121,1],[121,2,121,7],[122,0,122,1],[122,2,122,7],[136,19,142,19],[136,20,142,20],[136,23,142,23],[136,25,142,25],[136,30,142,30],[104,0,104,9],[136,38,142,38],[136,39,142,39],[152,0,152,9],[136,31,142,31],[136,32,142,32],[136,33,142,33],[136,34,142,34],[136,35,142,35],[136,36,142,36],[123,0,123,1],[123,2,123,7],[126,1,126,7],[127,1,127,7],[128,1,128,7],[129,1,129,7],[135,2,135,7],[136,17,142,17],[136,18,142,18]]}
["Berechnung Lagerraum für Gülle/Jauche und Stallmist"]
[null,null,"für tierhaltende Betriebe  (ohne Biogas, mit Separierung)"]
["Mindestanforderungen nach Düngeverordnung 1) Entwurf Stand: 17.10.18"]
[]
["Betriebsnummer:",null,"Kalenderjahr:",2018,null,null,"ha LF"]
["Vorname/Name:",null,null,null,null,null,"ha gesamte Ackerfläche"]
["Straße:",null,null,null,null,null,null,"davon Stillleg. Acker"]
["PLZ/Ort:",null,null,null,null,null,"ha gesamte Grünlandfläche"]
["Telefon:",null,null,null,null,null,null,"davon Stillleg. GL"]
[null,null,null,null,null,{"$f":"IF(F6+F8<>F5,\"Flächenangaben nicht plausibel\",IF(G7>F6,\"Flächenangaben nicht plausibel\",IF(G9>F8,\"Flächenangaben nicht plausibel\",\" \")))","v":" "}]
{"$rows_left_out":145}
{"sheet":"Abweichende Werte","index":2,"n_rows":33,"n_cols":22,"rows_kept":33,"cut":false,"hidden":false,"merged":[[0,0,0,2],[2,2,2,10],[32,0,32,9],[5,6,5,7],[5,8,5,10],[3,14,3,16],[3,3,3,5],[3,6,3,7],[3,8,3,10],[5,14,5,16],[5,11,5,13],[3,11,3,13],[5,3,5,5]]}
["Eingabemöglichkeit für abweichende Werte"]
[]
[null,null,"je Tier und Jahr (365 Tage)"]
[null,null,null,"Nährstoffanfall",null,null,"Anfall",null,"Anfall Mist",null,null,"TS-Gehalt",null,null,"Einstreu ",null,null,"spez. Gew."]
["Tierart","Tierbezeichnung","GV","N","P2O5","K2O","Gülle","Jauche","gering","mittel","hoch","Gülle","Jauche","Mist","gering","mittel","hoch","Mist"]
[null,null,null,"kg",null,null,"m³",null,"t",null,null,"%",null,null,"kg/GV und Tag",null,null,"t/m³",null,"Tierart"]
[null,null,null,null,null,null,null,null,null,null,null,null,null,null,null,null,null,null,null,1,{"$f":"INDEX(Tiere!$D$83:$D$87,T7)","v":" --"},{"$f":"+CONCATENATE(U7,\" - \",+B7)","v":" -- - "}]
[null,null,null,null,null,null,null,null,null,null,null,null,null,null,null,null,null,null,null,1,{"$f":"INDEX(Tiere!$D$83:$D$87,T8)","v":" --"},{"$f":"+CONCATENATE(U8,\" - \",+B8)","v":" -- - "}]
[null,null,null,null,null,null,null,null,null,null,null,null,null,null,null,null,null,null,null,1,{"$f":"INDEX(Tiere!$D$83:$D$87,T9)","v":" --"},{"$f":"+CONCATENATE(U9,\" - \",+B9)","v":" -- - "}]
[]
{"$rows_left_out":24}
{"sheet":"Zu- und Abgang","index":3,"n_rows":26,"n_cols":19,"rows_kept":26,"cut":false,"hidden":true,"merged":[[9,1,9,3],[10,1,10,3],[3,4,3,5],[2,17,2,18],[2,0,3,3],[2,6,2,8],[2,13,2,15],[7,1,7,3],[8,1,8,3]]}
["2. Zu- und Abgang organischer (und organisch-mineralische) Düngemittel"]
[]
["Organisch (und organisch-mineralische) Düngemittel ",null,null,null,"Zugang","Abgang","kg/t bzw. m³",null,null,null,null,null,null,"Nährstoffgehalt org. Dünger",null,null,"Art","Summe"]
[null,null,null,null,"t bzw. m³",null,"N","P2O5","K2O",null,null,null,null,"N","P2O5","K2O","flüssig/fest","flüssig m³","fest in t"]
[null,null,null,null,null,null,{"$f":"IF(N5>0.1,N5,\"\")","v":""},{"$f":"IF(O5>0.1,O5,\"\")","v":5},6,null,null,null,1,{"$f":"INDEX('org Dünger'!G$8:G$34,M5)","v":0},{"$f":"INDEX('org Dünger'!H$9:H$34,M5)","v":5},{"$f":"INDEX('org Dünger'!I$9:I$34,M5)","v":6},1,{"$f":"IF(Q5=2,E5-F5,0)","v":0},{"$f":"IF(Q5=3,E5-F5,0)","v":0}]
[null,null,null,null,null,null,{"$f":"IF(N6>0.1,N6,\"\")","v":""},5,6,null,null,null,1,{"$f":"INDEX('org Dünger'!G$8:G$34,M6)","v":0},{"$f":"INDEX('org Dünger'!H$9:H$34,M6)","v":5},{"$f":"INDEX('org Dünger'!I$9:I$34,M6)","v":6},1,{"$f":"IF(Q6=2,E6-F6,0)","v":0},{"$f":"IF(Q6=3,E6-F6,0)","v":0}]
[null,null,null,null,null,null,{"$f":"IF(N7>0.1,N7,\"\")","v":""},5,6,null,null,null,1,{"$f":"INDEX('org Dünger'!G$8:G$34,M7)","v":0},{"$f":"INDEX('org Dünger'!H$9:H$34,M7)","v":5},{"$f":"INDEX('org Dünger'!I$9:I$34,M7)","v":6},1,0,0]
[null,null,null,null,null,null,null,null,null,null,null,null,null,null,null,null,1,0,0]
[null,null,null,null,null,null,null,null,null,null,null,null,null,null,null,null,1,0,{"$f":"IF(Q9=3,E9-F9,0)","v":0}]
[null,null,null,null,null,null,null,null,null,null,null,null,null,null,null,null,1,0,0]
{"$rows_left_out":17}
{"sheet":"Separierung","index":4,"n_rows":37,"n_cols":11,"rows_kept":37,"cut":false,"hidden":true,"merged":[[17,3,17,5],[0,0,0,7],[5,1,5,3],[6,1,6,3],[7,1,7,3],[8,1,8,3]]}
["Berechnung Lagerraum für Gülle/Jauche und Stallmist"]
[null,null,"für tierhaltende Betriebe (ohne Biogas, mit Separierung)"]
["Mindestanforderungen nach Düngeverordnung Entwurf Stand: 10.09.18"]
[]
["Betriebsnummer:",null,"Kalenderjahr:",2018,null,null,"ha LF"]
["Vorname/Name:",null,null,null,null,null,"ha gesamte Ackerfläche"]
["Straße:",null,null,null,null,null,null,"davon Stillleg. Acker"]
["PLZ/Ort:",null,null,null,null,null,"ha gesamte Grünlandfläche"]
["Telefon:",null,null,null,null,null,null,"davon Stillleg. GL"]
[null,null,null,null,null,{"$f":"IF(F6+F8<>F5,\"Flächenangaben nicht plausibel\",IF(G7>F6,\"Flächenangaben nicht plausibel\",IF(G9>F8,\"Flächenangaben nicht plausibel\",\" \")))","v":" "}]
{"$rows_left_out":28}
{"sheet":"Tiere","index":5,"n_rows":90,"n_cols":30,"rows_kept":90,"cut":false,"hidden":true,"merged":[[4,27,4,29],[4,22,4,24],[5,22,5,24],[6,12,6,14],[4,6,4,9],[4,12,4,14],[4,19,4,20],[5,6,5,9],[5,12,5,14],[5,19,5,20]]}
["                     (Stand: Januar 2018)",null,"Im Programm hinterlegte Daten aus Tabelle 4a+b+c"]
[null,null,null,null,null,null,null,null,null,null,null,null,null,null,null,null,null,null,null,null,null,"t/m³"]
[null,"Tiere für Beech. Lagerraum flüssig+fest"]
[]
[null,null,"Großvieh-","Nährstoffausscheidung",null,null,"Gülleanfall in m3",null,null,null,"% TS","Einstreu ","Festmist (nach DüV) 5)",null,null,"% TS","Jaucheanfall","Jaucheanfall 4)","% TS","Verluste in %",null,"spez. Gewicht","Einstreu",null,null,"Lager in Monaten Stallmist",null,"NH4-N Anteil"]
[null,"Programmname","einheit","kg je mittl.",null,null,"je mittl. Jahresbestand 2)",null,null,null,"Gülle","gering","je mittl. Jahresbestand 2)",null,null,"Mist","in m3 je mittl. ","in m3 je mittl. ","Jauche","Stall- und Lager",null,"Mist","kg je GV und Tag",null,null,"bis 2020","ab 2020","Gülle","Jauche ","Mist"]
[null,"49 Tierartengruppen","nach DüV","Jahresbestand 2)",null,null,null,"TM",null,"nach","nach DüV","(nach DüV)","Anfall in t/Jahr",null,null,"nach DüV","Jahresbest.²)","Jahresbest.²)",null,null,"Mist,","t/m³"]
[null,null,null,"N","P2O5","K2O",0.05,7.4999999999999997E-2,0.1,"DüV 3)","Anfall","kg/Tag","gering","mittel","hoch","Anfall","LfL","nach DüV ",null,"Gülle","Jauche"]
["Rinder"]
[null,"Ackerbetrieb 1), Stallhaltung",null,null," "]
{"$rows_left_out":81}
{"sheet":"Tiere orginal","index":6,"n_rows":72,"n_cols":18,"rows_kept":72,"cut":false,"hidden":true,"merged":[[6,11,6,13],[4,6,4,9],[4,11,4,13],[4,16,4,17],[5,6,5,9],[5,11,5,13],[5,16,5,17]]}
["                     (Stand: Januar 2018)",null,"Im Programm hinterlegte Daten aus Tabelle 4a+b+c"]
[]
[]
[]
[null,null,"Großvieh-","Nährstoffausscheidung",null,null,"Gülleanfall in m3",null,null,null,"Einstreu ","Festmist (nach DüV) 5)",null,null,"Jaucheanfall","Jaucheanfall 4)","Verluste in %"]
[null,"Programmname","einheit","kg je mittl.",null,null,"je mittl. Jahresbestand 2)",null,null,null,"gering","je mittl. Jahresbestand 2)",null,null,"in m3 je mittl. ","in m3 je mittl. ","Stall- und Lager"]
[null,"49 Tierartengruppen","nach DüV","Jahresbestand 2)",null,null,null,"TM",null,"nach","(nach DüV)","Anfall in t/Jahr",null,null,"Jahresbest.²)","Jahresbest.²)",null,"Mist,"]
[null,null,null,"N","P2O5","K2O",0.05,7.4999999999999997E-2,0.1,"DüV 3)","kg/Tag","gering","mittel","hoch","LfL","nach DüV ","Gülle","Jauche"]
["Rinder"]
[null,"Kälber (Zucht/Mast) bis 6 Monate ",0.3,22,7.6,22.6,7.5,5,3.7,3.3,1.5,2.7,3.5,4.5999999999999996,1.7,1.2,15,30]
{"$rows_left_out":63}
{"sheet":"org Dünger","index":7,"n_rows":34,"n_cols":9,"rows_kept":34,"cut":false,"hidden":true,"merged":[[4,4,6,4],[5,0,5,1]]}
["Tabelle 5:  Nährstoffgehalte organischer Dünger zum Zeitpunkt der Ausbringung,",null,null,null,null,null,null,null,"Im Programm hinterlegte Daten"]
["                  die anrechenbaren Stall- und Lagerungsverluste sind berücksichtigt"]
["                  (Stand: März 2018)"]
[" "]
[null,null,null,null,"Einheit","TM"]
["Organischer Dünger mit Code-Nr.",null,"Art 2","Art 3",null,"in"]
[null,null,null,null,null,"%","Ngesamt","P2O5","K2O"]
["Rind"]
[11,"Milchviehgülle (Grünland, 6 % TM)",1,1,"m3",6,3.3,5,6]
[12,"Milchviehgülle (Grünland, 7,5 % TM)",1,1,"m3",7.5,4.2,5,8]
{"$rows_left_out":25}
{"sheet":"Stroh","index":8,"n_rows":4,"n_cols":2,"rows_kept":4,"cut":false,"hidden":true,"merged":[]}
[]
[1,"gering"]
[2,"mittel"]
[3,"hoch"]

{"sheet":"Erläuterungen","index":9,"n_rows":77,"n_cols":5,"rows_kept":77,"cut":false,"hidden":true,"merged":[[2,0,2,1],[15,0,16,0],[15,1,16,1],[18,4,19,4],[23,4,24,4],[29,0,30,0],[29,1,30,1],[35,0,36,0],[35,1,36,1],[47,0,48,0],[47,1,48,1],[50,0,51,0],[50,1,51,1],[68,0,69,0],[68,1,69,1],[71,0,72,0],[71,1,72,1],[53,0,54,0],[53,1,54,1],[56,0,57,0],[56,1,57,1],[62,0,63,0],[62,1,63,1]]}
["Erläuterung zur Zuordnung der Tiergruppen vom Mehrfachantrag zum 170 kg Programm"]
[]
["Mehrfachantrag",null,null,null,"Excel Programm 170 kg"]
["Code","Viehverzeichnis",null,null,"Tierauswahl"]
[]
["01","  Kälber (Zucht/Mast) bis 6 Monate",null,null,"  Kälber (Zucht/Mast) bis 6 Monate "]
[]
["04","  Männliche Rinder über 6 Monate bis 1 Jahr",null,null,"  Männliche Rinder über 6 Monate bis 1 Jahr"]
["05","  Männliche Rinder über 1 Jahr bis 2 Jahre",null,null,"  Männliche Rinder über 1 Jahr bis zwei Jahre (Mast)"]
["06","  Männliche Rinder über 2 Jahre, Zuchtbullen",null,null,"  Männliche Rinder über 2 Jahre, Zuchtbullen "]
{"$rows_left_out":68}
{"sheet":"alt Tiere","index":10,"n_rows":84,"n_cols":14,"rows_kept":84,"cut":false,"hidden":true,"merged":[[23,3,23,5],[23,8,23,9],[24,3,24,5],[24,8,24,9],[25,3,25,5]]}
[]
[null,null,"Milchleistung"]
[null,null,6555,null,"Acker",null,null,"Milchkuh (6000 kg Milch,0,9 Kalb)",null,100,null,null,{"$f":"IF(C3<=6000,J3,IF(AND(C3>6000,C3<=8000),J3+L4*(C3-6000),IF(AND(C3>8000,C3<=10000),J4+L5*(C3-8000),IF(AND(C3>10000,C3<=12000),J5+L6*(C3-10000),J6))))","v":104.16249999999999}]
[null,null,null,null,null,null,null,"Milchkuh (8000 kg Milch, 0,9 Kalb)",null,115,null,{"$f":"+(J4-J3)/2000","v":7.4999999999999997E-3}]
[null,null,null,null,null,null,null,"Milchkuh (10000 kg Milch, 0,9 Kalb)",null,133,null,{"$f":"+(J5-J4)/2000","v":8.9999999999999993E-3}]
[null,null,"Grünlandanteil %",null,null,null,null,"Milchkuh (12000 kg Milch, 0,9 Kalb)",null,152,null,{"$f":"+(J6-J5)/2000","v":9.4999999999999998E-3}]
[null,null,{"$f":"+'Berech. Lagerraum flüssig+fest'!BD11","v":0}]
[null,null,null,null,"Grünland",null,null,"Milchkuh (6000 kg Milch, 0,9 Kalb)",null,109,null,null,{"$f":"IF(C3<=6000,J8,IF(AND(C3>6000,C3<=8000),J8+L9*(C3-6000),IF(AND(C3>8000,C3<=10000),J9+L10*(C3-8000),J10)))","v":113.16249999999999}]
[null,null,null,null,null,null,null,"Milchkuh (8000 kg Milch, 0,9 Kalb)",null,124,null,{"$f":"+(J9-J8)/2000","v":7.4999999999999997E-3}]
[null,null,null,null,null,null,null,"Milchkuh (10000 kg Milch, 0,9 Kalb)",null,141,null,{"$f":"+(J10-J9)/2000","v":8.5000000000000006E-3}]
{"$rows_left_out":75}
{"sheet":"Tabelle1","index":11,"n_rows":3,"n_cols":3,"rows_kept":3,"cut":false,"hidden":true,"merged":[]}
["Weidestunden in % bezieht sich auf die Gesamtzahl der Tiere einer Haltungsart und gibt die durchschnittlichen Weidestunden eines Jahres gesehen auf alle Tiere wieder. Wenn nur ein Teil der Tiere Zugang zur Weide hat, reduzieren sich die durchschnittlichen Weidestunden je Tier, obwohl einzelne Tiere mehr Weidestunden haben."]
[null,"Beispiel: 30 % bedeutet, dass die Tiere durchschnittlich in 30 % der Stunden eines Jahres auf der Weide stehen und 70 % im Stall. "]
[null,null,"Berechnung: Anzahl Tiere mit Weidezugang * Ø tägliche Weidestunden * Anzahl Tage mit Weidestunden/24 Stunden/365 Tage/Gesamtzahl Tiere der Haltungsart= % Weidestunden eines Jahres“"]

{"sheet":"Tabelle2","index":12,"n_rows":0,"n_cols":0,"rows_kept":0,"cut":false,"hidden":true,"merged":[]}

{"sheet":"Hinweise zum Programm","index":13,"n_rows":12,"n_cols":7,"rows_kept":12,"cut":false,"hidden":true,"merged":[[7,6,8,10]]}
[]
["2018-09-11","mit Lichti","für Biogas wird es eine Zeile \"sonstige Einsatzstoffe\" geben/ diese sonstigen Einsatzstoffe dürfen bis zu 5% der FM betragen"]
["2018-09-11","mit Lichti","Eigenstromanteil: wird mit 9% angesetzt"]
["2018-09-11","mit Lichti","basisdaten werden von der Landtechnik ergänzt"]
[null,null,"mit Gasertrag L / kg org TS"]
[null,null,"Methangehalt "]
[null,null,"org TS"]
[null,null,"Methangewicht ",null,null,null,"kann von Gasertrag und Methangehalt abgeleitet werden"]
[null,null,"CO2 Gewicht"]
[null,null,"Wasser in TS (Gewicht)"]
{"$rows_left_out":3}
{"sheet":"Tiere2","index":14,"n_rows":90,"n_cols":27,"rows_kept":90,"cut":false,"hidden":true,"merged":[[6,12,6,14],[4,6,4,9],[4,12,4,14],[4,19,4,20],[4,22,4,24],[5,6,5,9],[5,12,5,14],[5,19,5,20],[5,22,5,24]]}
["                     (Stand: Januar 2018)",null,"Im Programm hinterlegte Daten aus Tabelle 4a+b+c"]
[null,null,null,null,null,null,null,null,null,null,null,null,null,null,null,null,null,null,null,null,null,"t/m³"]
[null,"Tiere für Betriebe mit Separation"]
[]
[null,null,"Großvieh-","Nährstoffausscheidung",null,null,"Gülleanfall in m3",null,null,null,"% TS","Einstreu ","Festmist (nach DüV) 5)",null,null,"% TS","Jaucheanfall","Jaucheanfall 4)","% TS","Verluste in %",null,"spez. Gewicht","Einstreu",null,null,"Lager in Monaten Stallmist"]
[null,"Programmname","einheit","kg je mittl.",null,null,"je mittl. Jahresbestand 2)",null,null,null,"Gülle","gering","je mittl. Jahresbestand 2)",null,null,"Mist","in m3 je mittl. ","in m3 je mittl. ","Jauche","Stall- und Lager",null,"Mist","kg je GV und Tag",null,null,"bis 2020","ab 2020"]
[null,"49 Tierartengruppen","nach DüV","Jahresbestand 2)",null,null,null,"TM",null,"nach","nach DüV","(nach DüV)","Anfall in t/Jahr",null,null,"nach DüV","Jahresbest.²)","Jahresbest.²)",null,null,"Mist,","t/m³"]
[null,null,null,"N","P2O5","K2O",0.05,7.4999999999999997E-2,0.1,"DüV 3)","Anfall","kg/Tag","gering","mittel","hoch","Anfall","LfL","nach DüV ",null,"Gülle","Jauche"]
["Rinder"]
[null,"Ackerbetrieb 1), Stallhaltung",null,null," "]
{"$rows_left_out":81}
{"sheet":"Lagerr. GL. rote Gebiete","index":15,"n_rows":42,"n_cols":29,"rows_kept":42,"cut":false,"hidden":true,"merged":[[5,3,5,6]]}
["Güllelager"]
[]
[null,null,null,null,null,null,null,null,null,null,null,null,"Anfall/Jahr",null,"Monat"]
[null,null,null,null,null,null,null,null,null,null,null,null,"je ha in kg N",null,1,2,3,4,5,6,7,8,9,10,11,12,"Summe","%"]
[null,null,null,null,null,null,null,null,null,null,null,null,170,null,{"$f":"+M5/12","v":14.166666666666666},{"$f":"+O5","v":14.166666666666666},{"$f":"+P5","v":14.166666666666666},14.166666666666666,14.166666666666666,14.166666666666666,14.166666666666666,14.166666666666666,14.166666666666666,14.166666666666666,14.166666666666666,14.166666666666666,{"$f":"SUM(O5:Z5)","v":170},100]
[null,null,null,"Düngung flüssiger org. Dünger"]
[null,null,null,"optimale Düngung","je nach Fruchtfolge","Acker nicht","keine Düngung",null,null,null,null,null,"Acker","Lager",{"$f":"+O5","v":14.166666666666666},{"$f":"+P5","v":14.166666666666666},null,null,null,{"$f":"+T5","v":14.166666666666666},14.166666666666666,14.166666666666666,14.166666666666666,14.166666666666666,14.166666666666666,14.166666666666666,{"$f":"SUM(O7:Z7)","v":127.50000000000001},{"$f":"+AA7/AA$5*100","v":75.000000000000014}]
[null,null,null,"Acker und GL","Acker/GL","GL ggf. möglich","möglich",null,null,null,null,null,null,"Ausgebracht",null,null,14.2,14.2,14.2]
[null,null,"Monate",3,3,1.5,4.5]
[null,null,null,null,null,null,null,null,null,null,null,null,"Grünland","Lager",{"$f":"+O7","v":14.166666666666666},{"$f":"+P7","v":14.166666666666666},null,null,null,null,null,null,null,null,{"$f":"+Y7","v":14.166666666666666},{"$f":"+Z7","v":14.166666666666666},{"$f":"SUM(O10:Z10)","v":56.666666666666664},{"$f":"+AA10/AA$5*100","v":33.333333333333329}]
{"$rows_left_out":33}
{"sheet":"Tabelle3","index":16,"n_rows":0,"n_cols":0,"rows_kept":0,"cut":false,"hidden":true,"merged":[]}

{"sheet":"Niederschläge","index":17,"n_rows":98,"n_cols":12,"rows_kept":98,"cut":false,"hidden":true,"merged":[]}
["LKR_txt","lkrname",null,"MEAN","mm"]
[161,"Ingolstadt","Ingolstadt",709.29411764700001,"mm",null,{"$f":"LEFT('Berech. Lagerraum flüssig+fest'!$P$9,3)","v":"0"},{"$f":"+G2","v":"0"},{"$f":"VALUE(H2)","v":0},{"$f":"IF(I2=A2,1,0)","v":0},{"$f":"IF(J2>0,D2,0)","v":0}]
[162,"M┬ünchen","München",993.33224755699996,"mm",null,{"$f":"LEFT('Berech. Lagerraum flüssig+fest'!$P$9,3)","v":"0"},{"$f":"+G3","v":"0"},{"$f":"VALUE(H3)","v":0},{"$f":"IF(I3=A3,1,0)","v":0},{"$f":"IF(J3>0,D3,0)","v":0}]
[163,"Rosenheim","Rosenheim",1146.28571429,"mm",null,{"$f":"LEFT('Berech. Lagerraum flüssig+fest'!$P$9,3)","v":"0"},"0",0,0,0]
[171,"AltÔÇØtting","Altötting",956.47879858700003,"mm",null,{"$f":"LEFT('Berech. Lagerraum flüssig+fest'!$P$9,3)","v":"0"},"0",0,0,0]
[172,"Berchtesgadener Land","Berchtesgadener Land",1877.54655381,"mm",null,{"$f":"LEFT('Berech. Lagerraum flüssig+fest'!$P$9,3)","v":"0"},"0",0,0,0]
[173,"Bad TÔÇØlz-Wolfratshausen","Bad Tölz-Wolfratshausen",1624.00090662,"mm",null,{"$f":"LEFT('Berech. Lagerraum flüssig+fest'!$P$9,3)","v":"0"},"0",0,0,0]
[174,"Dachau","Dachau",900.56325823199995,"mm",null,{"$f":"LEFT('Berech. Lagerraum flüssig+fest'!$P$9,3)","v":"0"},"0",0,0,0]
[175,"Ebersberg","Ebersberg",1074.52432432,"mm",null,{"$f":"LEFT('Berech. Lagerraum flüssig+fest'!$P$9,3)","v":"0"},"0",0,0,0]
[176,"EichstÔÇ×tt","Eichstätt",790.45349794200001,"mm",null,{"$f":"LEFT('Berech. Lagerraum flüssig+fest'!$P$9,3)","v":"0"},"0",0,0,0]
{"$rows_left_out":88}